Bug 5678 - nunit makes banshee-community-extensions to fail
Summary: nunit makes banshee-community-extensions to fail
Status: NEW
Alias: None
Product: Class Libraries
Classification: Mono
Component: mscorlib (show other bugs)
Version: unspecified
Hardware: PC Linux
: --- normal
Target Milestone: Untriaged
Assignee: Bugzilla
URL:
Depends on:
Blocks:
 
Reported: 2012-06-15 16:39 UTC by Pacho Ramos
Modified: 2013-05-08 03:30 UTC (History)
2 users (show)

Tags:
Is this bug a regression?: ---
Last known good build:

Notice (2018-05-24): bugzilla.xamarin.com is now in read-only mode.

Please join us on Visual Studio Developer Community and in the Xamarin and Mono organizations on GitHub to continue tracking issues. Bugzilla will remain available for reference in read-only mode. We will continue to work on open Bugzilla bugs, copy them to the new locations as needed for follow-up, and add the new items under Related Links.

Our sincere thanks to everyone who has contributed on this bug tracker over the years. Thanks also for your understanding as we make these adjustments and improvements for the future.


Please create a new report for Bug 5678 on GitHub or Developer Community if you have new information to add and do not yet see a matching new report.

If the latest results still closely match this report, you can use the original description:

  • Export the original title and description: GitHub Markdown or Developer Community HTML
  • Copy the title and description into the new report. Adjust them to be up-to-date if needed.
  • Add your new information.

In special cases on GitHub you might also want the comments: GitHub Markdown with public comments

Related Links:
Status:
NEW

Description Pacho Ramos 2012-06-15 16:39:39 UTC
This was originally reported downstream on Gentoo:
https://bugs.gentoo.org/show_bug.cgi?id=372615

But banshee-community-extensions developer pointed me to here:
https://bugzilla.gnome.org/show_bug.cgi?id=653195
https://bugzilla.gnome.org/show_bug.cgi?id=653195#c5

The error is:

Making check in Banshee.Mirage

Unhandled Exception: System.Security.SecurityException: No access to the given key
  at Microsoft.Win32.KeyHandler..ctor (Microsoft.Win32.RegistryKey rkey, System.String basedir, Boolean is_volatile) [0x00057] in /var/tmp/portage/dev-lang/mono-2.10.9/work/mono-2.10.9/mcs/class/corlib/Microsoft.Win32/UnixRegistryApi.cs:138 
  at Microsoft.Win32.KeyHandler..ctor (Microsoft.Win32.RegistryKey rkey, System.String basedir) [0x00000] in <filename unknown>:0 
  at Microsoft.Win32.KeyHandler.Lookup (Microsoft.Win32.RegistryKey rkey, Boolean createNonExisting) [0x00096] in /var/tmp/portage/dev-lang/mono-2.10.9/work/mono-2.10.9/mcs/class/corlib/Microsoft.Win32/UnixRegistryApi.cs:401 
  at Microsoft.Win32.UnixRegistryApi.OpenSubKey (Microsoft.Win32.RegistryKey rkey, System.String keyname, Boolean writable) [0x00000] in /var/tmp/portage/dev-lang/mono-2.10.9/work/mono-2.10.9/mcs/class/corlib/Microsoft.Win32/UnixRegistryApi.cs:842 
  at Microsoft.Win32.RegistryKey.OpenSubKey (System.String name, Boolean writable) [0x0001e] in /var/tmp/portage/dev-lang/mono-2.10.9/work/mono-2.10.9/mcs/class/corlib/Microsoft.Win32/RegistryKey.cs:278 
  at Microsoft.Win32.RegistryKey.OpenSubKey (System.String name) [0x00000] in /var/tmp/portage/dev-lang/mono-2.10.9/work/mono-2.10.9/mcs/class/corlib/Microsoft.Win32/RegistryKey.cs:262 
  at (wrapper remoting-invoke-with-check) Microsoft.Win32.RegistryKey:OpenSubKey (string)
  at NUnit.Util.SettingsService.ConvertLegacySettings () [0x00000] in /var/tmp/portage/dev-lang/mono-2.10.9/work/mono-2.10.9/mcs/nunit24/ClientUtilities/util/Services/SettingsService.cs:53 
  at NUnit.Util.SettingsService..ctor () [0x00053] in /var/tmp/portage/dev-lang/mono-2.10.9/work/mono-2.10.9/mcs/nunit24/ClientUtilities/util/Services/SettingsService.cs:35 
  at NUnit.ConsoleRunner.Runner.Main (System.String[] args) [0x000c6] in /var/tmp/portage/dev-lang/mono-2.10.9/work/mono-2.10.9/mcs/nunit24/ConsoleRunner/nunit-console/Runner.cs:47 
  at NUnit.ConsoleRunner.Class1.Main (System.String[] args) [0x00000] in /var/tmp/portage/dev-lang/mono-2.10.9/work/mono-2.10.9/mcs/nunit24/ConsoleRunner/nunit-console-exe/Class1.cs:22 
make[3]: *** [test] Error 1
make[2]: *** [check-recursive] Error 1
make[1]: *** [check-recursive] Error 1
make: *** [check-recursive] Error 1

Thanks for your help