This is Xamarin's bug tracking system. For product support, please use the support links listed in your Xamarin Account.
Mon Aug 29 2016 16:26:15 UTC
The creation of random numbers is too important to be left to chance.
Hide Search Description
422 bugs found.
ID Product Comp Assignee Status Resolution Summary Changed
364 Runtime misc vargaz NEW --- Mysterious runtime crashes 2012-04-23
580 Runtime misc bugzilla NEW --- Type.Load loads strong type despite version mismatch 2012-01-20
772 Runtime misc bugzilla NEW --- WiX's light tool fails to use merge modules 2011-09-13
990 Runtime packagin duncan.mak NEW --- uninstallMono.sh is advertised in readme but not found in DMG 2014-01-12
1125 Runtime Debug vargaz NEW --- Stepping through MySql.Data.MySqlClient takes a minute to instantiate connector 2011-12-02
1506 Runtime JIT bugzilla NEW --- Support for JIT circular shifts 2013-05-15
1540 Runtime Debug vargaz REOP --- Debugger occasionally crashes on break 2013-09-16
1651 Runtime Debug bugzilla NEW --- Cannot continue debugging after watching recursive/long running operation 2011-11-15
1653 Runtime misc bugzilla NEW --- ThreadPool QueueUserWorkItem is slow 2012-11-01
1728 Runtime JIT vargaz NEW --- JIT compiler emits double-precision instructions for single-precision values in x86-64 2014-07-17
1770 Runtime verifier bugzilla NEW --- Verifier does not check not implemented constraints 2015-02-27
1772 Runtime io-layer bugzilla REOP --- Mono performance counters all return 0 2011-11-02
1801 Runtime Mono Too bugzilla NEW --- mono-service 2 only works on debug mode 2011-10-31
2098 Runtime JIT bugzilla REOP --- Mono JVM 4x slower than Java / C++ and "unsafe" code not showing perf improvement 2011-11-20
2197 Runtime Reflecti bugzilla NEW --- Result of execution of Assembly.GetCallingAssembly() differs between mono and windows native 2016-04-16
2251 Runtime interop bugzilla NEW --- mono crash. [System.Runtime.InteropServices.MarshalDirectiveException: Type System.DateTime which is passed to unmanaged code must have a StructLayout attribute.] 2011-11-29
2553 Runtime GC lupus ASSI --- Improve root information from the log profiler 2013-05-23
2560 Runtime interop bugzilla NEW --- Add a something similar to IntPtr for long type 2011-12-18
2845 Runtime misc bugzilla NEW --- GC + Thread.Abort() + Thread.Join() = Hang 2013-09-09
3220 Runtime GC bugzilla NEW --- shutdown race when the finalizer thread times out 2014-01-12
3222 Runtime interop bugzilla NEW --- GC does not release COM objects 2014-01-12
3417 Runtime Debug bugzilla NEW --- Step into line which is not executed 2013-09-09
3595 Runtime Debug vargaz NEW --- Cannot set breakpoint to valid expression 2013-09-09
3743 Runtime Debug vargaz NEW --- Static method not returning properly 2013-09-09
3804 Runtime remoting lluis NEW --- RemotingException when trying to round-trip a marshalbyrefobject 2012-09-02
3955 Runtime Mono Too bugzilla NEW --- mkbundle creates a package which wants the nonexistent gdiplus.dll 2016-01-12
4015 Runtime Debug bugzilla NEW --- Single stepping stops in weird places 2012-03-21
4021 Runtime Debug bugzilla NEW --- Project only debugging does not work 2012-04-12
4023 Runtime Debug vargaz NEW --- ThreadMirror.GetFrames() sometimes returns empty when it shouldn't. 2012-03-26
4032 Runtime Debug bugzilla NEW --- "Step Into" does not work correctly 2012-04-19
4433 Runtime Debug bugzilla NEW --- "step over properties and operators" also steps over method calls 2012-04-16
4531 Runtime Debug bugzilla NEW --- Task evaluation always timeouts 2013-09-09
4576 Runtime misc bugzilla REOP --- WebRequest fails during monodevelop debug but not on command line. 2012-04-27
5092 Runtime interop bugzilla NEW --- Cannot run program - method too complex 2015-07-12
5358 Runtime JIT bugzilla NEW --- CS0589 on arm Linux 2013-12-09
5386 Runtime Debug vargaz NEW --- Debugger steps to line with no sequence point 2012-05-29
5438 Runtime Debug bugzilla NEW --- The LineNumbers () sdb test fails with master. 2012-05-31
5804 Runtime misc bugzilla NEW --- Thread.ResetAbort can prevent appdomain unloading 2012-06-22
5865 Runtime Debug joao NEW --- Application crashing in debug only when starting Ftp Request Stream 2014-02-12
6040 Runtime misc bugzilla REOP --- AOT and generics instantiation 2014-01-30
6046 Runtime GC bugzilla NEW --- "Too many root sets" GC fatal error when running NUnit on corlib (Windows) 2013-03-07
6199 Runtime Debug bugzilla NEW --- debugger deadlocks MD 2013-03-28
6208 Runtime Debug bugzilla NEW --- .NET Manual Reset Event does not block when debugging in Mono 2012-09-02
6216 Runtime misc bugzilla NEW --- mmap(...PROT_NONE...) failed 2014-11-18
6291 Runtime io-layer bugzilla NEW --- OSX: use KQueue to correctly support Process' WaitForExit and Exited event on external processes. 2015-06-19
6346 Runtime JIT vargaz NEW --- Mono does not support vararg pinvoke methods 2015-02-08
6397 Runtime Debug vargaz NEW --- Debugger locks up instead of breaking at breakpoint 2015-02-20
6440 Runtime Mono Too vargaz NEW --- mcs-docs fails to build on ppc 2012-10-05
6573 Runtime JIT bugzilla REOP --- Mono Runtime exceptions are not handled 2012-09-04
6606 Runtime remoting lluis NEW --- RemotingException when using a cross domain marshaller object 2012-09-02
6956 Runtime Debug bugzilla NEW --- Expression Evaluator parser does not perform implicit conversions (C#) 2012-09-27
7055 Runtime misc lupus NEW --- Threadpool SetMinThreads only creates one new thread 2013-08-23
7070 Runtime generics bugzilla NEW --- Using reflection to invoke a generic method on remoted objects that do not implement an interface results in a slot assertion 2012-09-11
7127 Runtime interop bugzilla NEW --- PInvoke with parameter a class without StructLayout 2012-09-13
7197 Runtime misc bugzilla NEW --- Configure errors on Gentoo/ia64: can't find the right libunwind 2012-09-16
7251 Runtime packagin duncan.mak NEW --- Missing env.{csh,sh} in Mono 2.10.10 and 2.11.4 Mac packages 2015-01-08
7565 Runtime Reflecti bugzilla NEW --- TypeLoadException when running Scala.NET compiler 2012-11-30
7901 Runtime Debug bugzilla NEW --- Debugger steps over variable asignments when you use step into 2012-10-18
7967 Runtime misc bugzilla NEW --- mod_mono_server broken with 3.0 2014-02-26
7981 Runtime JIT bugzilla NEW --- Mono 3.0 double type conversion to long type fails on MIPS hardware 2014-05-31
8013 Runtime io-layer bugzilla NEW --- mono prints escape sequences ^[[1;1R^[[1;8R even when stdout is not the standard output 2012-10-26
8042 Runtime misc bugzilla NEW --- mono StackOverflowExceptions thrown with ikvm + NetalyzrCLI.jar 2013-05-18
8058 Runtime JIT bugzilla NEW --- Trivial to deadlock the runtime 2012-10-30
8207 Runtime misc bugzilla REOP --- Can't set 1000000 baud with System.IO.Ports.SerialPort.BaudRate 2015-05-12
8418 Runtime generics bugzilla NEW --- nuget crashes mono-3 with "Assertion at mini-generic-sharing.c:1318, condition `ret == 0' not met" 2012-11-17
8477 Runtime JIT bugzilla NEW --- Mono fails to load valid program * Assertion at cominterop.c:331, condition `MONO_CLASS_IS_INTERFACE (ic)' not met 2012-11-17
8518 Runtime Debug vargaz NEW --- We disable seqpoints for wrappers on Android 2013-08-23
8693 Runtime packagin bugzilla NEW --- Installing Mono 2.8.x removes Mono 3.0.x 2012-12-03
8731 Runtime misc lupus ASSI --- async io bug 2013-06-26
8877 Runtime JIT bugzilla NEW --- Mono crashes when using the debug variants of the macos system libraries 2013-01-03
9150 Runtime Debug vargaz NEW --- [PATCH] do not crash at unresolved custom attribute 2015-02-20
9153 Runtime GC bugzilla NEW --- glibc detected mono: corrupted double-linked list: 0x00007f58a9119fe0 2013-10-25
9365 Runtime Debug vargaz NEW --- Breakpoints hit but no execution frame/callstack (Soft debugging/embedded Mono) 2013-04-06
9545 Runtime verifier kumpera NEW --- Explicitly implement an interface method with weaker type parameter constraint 2013-05-02
9738 Runtime interop bugzilla NEW --- Calling an unmanaged thunk creates a NullReferenceException 2013-01-23
9845 Runtime misc bugzilla NEW --- mono_jit_init() not initializing the AppDomain appropriately 2013-02-01
9970 Runtime packagin duncan.mak NEW --- MRE-3.0.3 installation fails on OSX 10.6.8 2013-02-01
10000 Runtime misc bugzilla NEW --- Segmentation fault at exit when using Npgsql via Assembly.Load 2013-02-03
10038 Runtime interop bugzilla NEW --- mono fails to find the entry point. 2013-02-05
10071 Runtime io-layer bugzilla NEW --- SIGSEV from accessing socket.RemoteEndPoint 2013-02-06
10087 Runtime misc bugzilla NEW --- Process exit can be blocked if the AppDomain.ProcessExit event hangs 2013-02-06
10101 Runtime GC bugzilla NEW --- Perfomance counters for Generational GC do not work 2013-02-06
10108 Runtime Debug bugzilla NEW --- mono_jit_cleanup asserts/aborts on shutdown if soft debugging 2016-07-08
10126 Runtime misc bugzilla NEW --- Module initializer and assembly resolve 2014-02-07
10160 Runtime misc bugzilla NEW --- Don't hide the internal Exceptions 2013-03-15
10343 Runtime JIT bugzilla NEW --- On debugging MonoDevelop with MonoDevelop a SIGABRT occurs. 2013-02-17
10354 Runtime misc bugzilla NEW --- Unhelpful TypeLoadExceptions when dependencies (using inheritance) missing 2013-05-17
10424 Runtime verifier kumpera NEW --- Valid code rejected with Function pointer signature 'string' doesn't match delegate's signature 'string' 2013-02-19
10784 Runtime misc bugzilla NEW --- Too many classes implementing an interface? Assertion at class.c:2586, condition `iid <= 65535' not met 2013-05-16
10906 Runtime Reflecti bugzilla NEW --- Assembly.Load of mscorlib overrides typeof<System.Object>.Assembly.Location (not so in .NET) 2016-04-16
10987 Runtime Debug bugzilla NEW --- Make it possible to enumerate attachable Mono processes 2015-10-30
11004 Runtime packagin bugzilla NEW --- Mono 3.0.6 on does not correctly package ASP.NET MVC 3 assemblies 2013-08-25
11100 Runtime JIT bugzilla NEW --- xsp segfaults on mono 3.0.8 (March 13) 2013-03-13
11199 Runtime Reflecti bugzilla NEW --- Assembly.Load(byte[]) loads cached assemblies 2015-10-17
11322 Runtime GC bugzilla NEW --- unmanaged crash in object.__icall_wrapper_mono_gc_alloc_vector: "no object of size 1077429032" 2015-01-22
11430 Runtime Mono Too grendel NEW --- mkbundle doesn't support satellite assemblies 2016-05-31
11599 Runtime Debug vargaz NEW --- Stack trace of dynamically generated assembly is missing debug information 2013-04-04
11696 Runtime verifier kumpera NEW --- Missing MethodImpl has a duplicate 2013-04-10
11899 Runtime interop bugzilla NEW --- OffsetOf identical for two cases, only one deserializes properly 2013-04-27
11903 Runtime misc lupus ASSI --- log profiler: statistical information isn't available until the profiled process has exited (cleanly) 2013-05-15
12012 Runtime generics bugzilla NEW --- TcpClient.Close() doesn't work 2014-12-31
12044 Runtime GC bugzilla REOP --- Saving Program Options Causes Crashes 2013-05-29
12144 Runtime generics bugzilla NEW --- maybe a float computing bug. 2013-05-08
12155 Runtime Debug vargaz NEW --- [PPC] Runtime crashes when inspecting variable in XamarinStudio 2013-09-16
12157 Runtime verifier kumpera NEW --- Missing: Init state for this differs depending on path 2013-05-08
12193 Runtime io-layer bugzilla NEW --- System.Net.Sockets.Socket SendToAsync not work in epoll 2013-05-10
12307 Runtime JIT bugzilla NEW --- Unhandled exception at 0x65B513F7 (mono-2.0.dll) in mono.exe 2014-03-07
12391 Runtime Mono Too bugzilla NEW --- mono-3.0.7: prj2make fails to run 2013-05-24
12610 Runtime GC bugzilla NEW --- gc-altstack.exe randomly fails with sgen on wrench 2013-06-09
12635 Runtime JIT bugzilla NEW --- Tail calls inside continuations cause StackOverflow 2016-02-17
12684 Runtime Debug vargaz REOP --- Could not connect to the debugger 2016-05-14
12742 Runtime Debug vargaz REOP --- Cannot start debugger sessions reliably 2013-12-10
12966 Runtime misc bugzilla NEW --- 3.0.12 on PowerPC fails to build F# 3.0 2013-06-29
12967 Runtime misc bugzilla NEW --- F# 2.0 prebuilt compiler fails to run under mono 3.0.12 on powerpc 2013-06-29
13002 Runtime misc bugzilla NEW --- targetFramework="4.5" not recognized for httpRuntime section 2013-07-02
13106 Runtime packagin duncan.mak NEW --- "Edit References -> .NET Assembly" crash on "Recently Used" 2013-07-09
13368 Runtime Debug vargaz NEW --- Show return values in debugger 2015-10-19
13384 Runtime Debug vargaz NEW --- Useful stack traces for async code 2013-07-23
13399 Runtime Debug vargaz NEW --- Step Over behavior inconsistent in code using await Task.Run () 2013-07-23
13410 Runtime JIT bugzilla NEW --- Infinite recursion in C# code leads to a crash 2013-07-23
13544 Runtime GC bugzilla NEW --- --enable-big-arrays is broken 2016-03-08
13598 Runtime JIT bugzilla NEW --- SIGSEGV in WaitHandle.WaitAll 2013-07-30
13717 Runtime Debug vargaz NEW --- [iOS]Application comes out of debug mode on setting a break point and clicking step into, in iOS simulator 2013-09-16
13813 Runtime GC alexander.kyte REOP --- Mono crashes when AppDomains are created in parallel (few) 2015-12-04
13831 Runtime GC bugzilla NEW --- Mono block execution unproportional to individual execution 2013-08-21
14060 Runtime Reflecti bugzilla NEW --- DynamicILInfo.SetLocalSignature() is not implemented, blocking Jurassic JavaScript engine working 2013-08-21
14698 Runtime misc bugzilla NEW --- crash in zlib-helper.c 2015-03-25
14989 Runtime interop bugzilla NEW --- running with mono, calling a dll, throw - catch inside the dll ceases to work. works with .net and earlier mono versions 2013-10-07
15064 Runtime io-layer bugzilla NEW --- AppDomains: crashdump on System.AppDomain.ProcessMessageInDomain 2013-11-29
15118 Runtime io-layer bugzilla NEW --- Console read methods messes up terminal after program finishes 2013-10-02
15130 Runtime Debug vargaz NEW --- Cannot step into framework Console.WriteLine 2013-11-02
15261 Runtime GC bugzilla NEW --- SGEN: Assertion at sgen-alloc.c:425, condition `*p == NULL' not met 2014-01-16
16225 Runtime verifier kumpera NEW --- Verifier does not check invalid forwarded type 2013-11-14
16490 Runtime remoting bugzilla NEW --- NullReferenceException in CrossAppDomainSink.SyncProcessMessage 2013-12-16
16664 Runtime Debug vargaz NEW --- Wrong values displayed for captured variables 2014-01-22
16685 Runtime io-layer lupus ASSI --- Deadlock when using Windows Azure Storage libraries 2013-12-10
16785 Runtime Mono Too lupus ASSI --- Mono could not find profiler when compiled with llvm 2014-10-10
16807 Runtime misc vargaz NEW --- Assertion should not be reached while run code from debugger. 2014-07-21
16808 Runtime JIT vargaz ASSI --- ThreadAbortException. Finally block does not execute 2014-01-08
17010 Runtime Reflecti bugzilla REOP --- System.ExecutionEngineException when reflecting a class with a static constructor and non-resolvable instance type 2014-01-12
17325 Runtime remoting bugzilla NEW --- RealProxy returns MarshalByRefObject for an Interface instead of the real interface type 2015-06-03
17333 Runtime GC bugzilla NEW --- _wapi_handle_ref/_wapi_handle_unref_full errors 2014-03-08
17398 Runtime io-layer bugzilla NEW --- GetDrives does not return all mounted drives 2014-01-27
17495 Runtime GC bugzilla NEW --- Array.Copy (FastCopy) path is copying the wrong data on ARM devices 2014-04-02
17501 Runtime misc bugzilla NEW --- Math.Round (double.MaxValue, 1) results in Infinity 2014-01-30
17572 Runtime JIT bugzilla NEW --- Unfounded 'ExecutionEngineException: Attempting to JIT compile method while running with --aot-only" 2014-02-04
17909 Runtime misc bugzilla NEW --- System.Web tests crash randomly 2014-04-10
17933 Runtime verifier kumpera NEW --- Missing IL check for filter type 2014-02-21
17944 Runtime misc vladimir.kargov ASSI --- mono: mini-amd64.c:492: amd64_patch: Assertion `0' failed. 2014-09-04
18081 Runtime GC bugzilla NEW --- LLVM: Mono Crashes while creating AppDomains in Parallel 2014-02-28
18098 Runtime JIT bugzilla NEW --- Mono runtime SIGSEGV while xsp2 is handling ThreadAbortException 2014-04-22
18328 Runtime misc bugzilla NEW --- Process: WaitForExit returns immediately for managed app that is still running 2014-03-17
18358 Runtime verifier kumpera NEW --- Error: Invalid method row 0 is RtSpecialName but not named .ctor or .cctor 2014-03-13
18555 Runtime misc bugzilla NEW --- mono can't find MonoPosixHelper when not installed in a /usr or /usr/local 2014-05-28
18569 Runtime packagin duncan.mak NEW --- Getting error while building F# application with xbuild tool 2015-05-12
18619 Runtime JIT bugzilla NEW --- COM Interop Regression crash introduced between 3.0.12 and 3.1.1. 2014-05-21
18686 Runtime JIT bugzilla NEW --- More threads are created than system can handle 2014-04-10
18762 Runtime io-layer bugzilla NEW --- System.NotSupportedException: 0-byte integer when building from shared network folder 2014-04-04
18768 Runtime Mono Too bugzilla NEW --- mkbundle Assembly CodeBase uses Current Working Directory 2014-04-02
18865 Runtime GC bugzilla NEW --- WeakReference.TryGetTarget behavior is incorrect 2014-09-14
18941 Runtime interop alexander.kyte NEW --- Calling Marshal.SizeOf() with an Empty struct using Sequential or Explicit returns 0 2015-12-14
18956 Runtime misc bugzilla NEW --- AOT compiler generates invalid .so files in ARM hardfp 2015-08-05
19044 Runtime misc bugzilla NEW --- TypeLoadException when compiling mono 2015-05-08
19136 Runtime JIT bugzilla NEW --- ThreadAbortException Not finishing Finally block ARM 2014-06-21
19296 Runtime io-layer bugzilla NEW --- Process.Start does not accept windows style argument strings 2014-04-29
19436 Runtime misc bugzilla NEW --- probing/privatePath not considered when handling configSections 2014-04-30
19489 Runtime Reflecti bugzilla NEW --- Assembly loader fails to resolve type referenced from attribute 2014-05-02
19503 Runtime io-layer bugzilla NEW --- Process.Start on OS X fails silently for missing file 2014-05-02
19645 Runtime packagin duncan.mak NEW --- Cannot build mono OpenBSD5.5, configure script problems 2014-05-09
19665 Runtime io-layer bugzilla NEW --- Race in socket file descriptor handling 2016-07-11
20073 Runtime GC bugzilla NEW --- Deadlock in gc finalizer_thread 2014-07-07
20241 Runtime io-layer bugzilla NEW --- NetworkStream.Flush cause internal error 2014-05-31
20562 Runtime JIT bugzilla NEW --- Seeming valid IL produces invalid result 2014-06-17
20721 Runtime JIT bugzilla NEW --- A cast of double to int can possibly result in int.MinValue 2014-06-19
20762 Runtime misc bugzilla NEW --- using ld(1) from binutils 2.24 causes 'local symbol is reference by DSO' on freebsd (at least) 2014-06-20
20871 Runtime misc bugzilla NEW --- SIGSEGV when using two appdomains 2014-06-29
21161 Runtime misc bugzilla REOP --- Crash in MD startup 2014-07-21
21382 Runtime interop bugzilla NEW --- mono_domain_from_appdomain should handle transparent proxies. 2014-07-16
21520 Runtime misc bugzilla REOP --- mono build is broken because of test-conc-hashtable failing to link 2015-06-15
22664 Runtime packagin duncan.mak NEW --- Dependency problem installing mono-complete to centos 6.5 2015-04-14
23135 Runtime remoting bugzilla NEW --- Null reference exception on property value access of MarshalByRefObject 2014-09-18
23146 Runtime io-layer bugzilla NEW --- AbandonedMutexException is not thrown - so the WaitHandle.Wait* methods is broken 2015-11-17
23392 Runtime JIT bugzilla REOP --- * Assertion at mini-codegen.c:2307, condition `sp < 8' not met 2014-09-29
23437 Runtime misc martin.baulig NEW --- PCL Assembly TypeLoadException: Could not load type 'System.Object' from assembly 'System.Runtime 2015-06-13
23819 Runtime misc bugzilla NEW --- Assertion failure when failing to load an assembly 2015-02-19
23954 Runtime GC bugzilla REOP --- Missing checks for overlapping reference and non-reference fields. 2014-11-12
24093 Runtime JIT bugzilla NEW --- Mono 3.10 build fails on CentOS 5.11 amd64 2015-04-14
24544 Runtime misc bugzilla NEW --- Deadlock or assertion failed (threads != NULL) at shutdown 2014-11-14
24752 Runtime misc bugzilla NEW --- stack overflow when running F# compiler included with mono 2015-05-12
24755 Runtime misc bugzilla NEW --- Mono often crashes under Linux kernel 3.14 and higher 2016-05-07
24902 Runtime packagin duncan.mak NEW --- Pin to older version for deb packages results in apt error 2015-12-11
25092 Runtime Debug vargaz NEW --- * Assertion at mini-x86.c:6575, condition `code [0] == 0x90' not met 2016-07-31
25097 Runtime JIT bugzilla NEW --- mono stack-buffer-overflow on latest build 2015-04-14
25224 Runtime GC bugzilla REOP --- stack overflow after printfn something 2014-12-11
25293 Runtime Debug vargaz NEW --- Some runtime errors do not report filename and line number (static call) 2015-01-08
25629 Runtime misc bugzilla REOP --- nunit-console leaves zombie processes in mono 3.12 vs proper behavior in prior versions (3.10) 2015-02-07
25766 Runtime Debug vargaz NEW --- F# + PCL lib crashes debugger on start 2015-05-12
25821 Runtime misc bugzilla NEW --- Generic symbol names exported from libmono 2015-01-15
25953 Runtime interop bugzilla NEW --- SafeFileHandle 2015-03-05
26377 Runtime misc bugzilla NEW --- Add support for setting priorities for Threads in Mono. 2015-01-26
26394 Runtime JIT bugzilla NEW --- Error in call unsafe code 2015-01-26
26408 Runtime Debug vargaz NEW --- Application hangs 2015-03-02
26462 Runtime misc bugzilla NEW --- Mono 3.12.0 mod_mono not working on apache 2.2 2015-01-30
26557 Runtime misc bugzilla NEW --- Crash/Deadlock when loading/running metadata from background threads at app exit 2015-01-29
26869 Runtime Debug vargaz NEW --- Debugger crashes when it hits a debug point 2015-11-27
26960 Runtime packagin duncan.mak NEW --- Opening a PCL project in Xamarin Studio has different platform targets than in Visual Studio. 2015-04-14
27585 Runtime misc bugzilla NEW --- Mono compilations fail with gmcs.exe: MZ▒▒▒▒@▒▒▒: not found on Zynq 2016-04-16
27716 Runtime packagin jo.shields NEW --- Could you fix rpm dependencies to install also in Centos 6? 2015-10-22
27726 Runtime io-layer bugzilla NEW --- UNIX Console semantics not available on Win32 in Cygwin 2015-03-06
27728 Runtime JIT bugzilla NEW --- Exception in Exception filters (C# 6) 2015-03-09
27881 Runtime JIT bugzilla NEW --- Bad virtual lookup for new abstract member 2015-03-11
27958 Runtime GC bugzilla NEW --- resgen sometime crashes (unstable) 2015-03-13
28337 Runtime misc bugzilla NEW --- Mono (Banshee) crashes on OpenBSD 5.7-current. 2015-04-02
28690 Runtime misc bugzilla NEW --- Loader error to MonoError transition 2015-04-02
28753 Runtime misc bugzilla NEW --- Intermittently failing ManualResetEventSlimTests on ARM 2015-04-06
28875 Runtime io-layer bugzilla NEW --- System.IO.Directory.EnumerateFiles on Mac is case-sensitive 2015-04-15
28890 Runtime misc bugzilla NEW --- remove_and_abort_threads adds to the wait list wrong handle 2015-04-08
29277 Runtime misc bugzilla NEW --- Creating a New Thread Causes the App to Crash 2015-05-22
29322 Runtime misc bugzilla NEW --- Certificate installation error on mono 4.1.0 2015-04-22
29427 Runtime JIT bugzilla NEW --- Support MUSL fully 2015-04-27
29462 Runtime misc bugzilla NEW --- Runtime segfaults after reaching a certain amount of threads 2015-04-28
29554 Runtime GC bugzilla NEW --- Crash when allocating large amounts of memory in cycle 2015-04-29
29586 Runtime packagin duncan.mak NEW --- Mono sources list breaks Synaptic Update on Ubuntu 12.04 2015-04-30
29692 Runtime misc bugzilla NEW --- Mono 4.0.1 SIGSEGV crash on Ubuntu 14.04 with libpthread.so.0 2015-08-17
29766 Runtime JIT bugzilla NEW --- Mono Runtime crashes when used with valgrind with/without Embedded Runtime 2015-05-06
29877 Runtime generics bugzilla NEW --- Assertion at mini-generic-sharing.c - Works on .NET, Fails on Mono 2015-07-06
29904 Runtime Mono Too bugzilla NEW --- Line numbers in profiler --traces output would be helpful 2015-05-09
29919 Runtime packagin duncan.mak NEW --- mono-find-provider/requires scripts always fail with Mono 4.0.1 RPMs 2015-05-11
29953 Runtime remoting bugzilla NEW --- Mocking libraries that use Castle.Core cause SIGABRT when mocking generic methods 2015-09-15
29962 Runtime GC bugzilla NEW --- undefined reference to `__dtraceenabled_mono___gc__finalize__invoke' when building Mono 4.1.0 on FreeBSD amd64 2015-05-18
29963 Runtime packagin duncan.mak NEW --- Mono 4.0.1 RPMs won't upgrade previous versions 2015-05-12
30010 Runtime GC bugzilla NEW --- Immediate Crashes on 4.0.1 and 4.1 (Master) - sgen crashes boehm works 2015-05-12
30083 Runtime io-layer bugzilla NEW --- io-layer only has 1s resolution for file time information. 2015-05-15
30090 Runtime JIT bugzilla NEW --- AOT compiler on OSX crashes with F# compiler and -O=all 2015-05-14
30146 Runtime misc bugzilla NEW --- stack imbalance in DllImport with CallingConvention.StdCall 2016-08-01
30165 Runtime misc bugzilla NEW --- Math.Floor does not always return a correct value 2015-05-18
30308 Runtime io-layer alexander.kyte NEW --- Waiting on external processes broken on 4.0.1+ monos on OSX, Linux, possibly others 2015-05-21
30355 Runtime misc bugzilla NEW --- Crash while running Roslyn 2015-05-22
30360 Runtime misc bugzilla NEW --- Error in handling of /etc/localtime file to retrieve time zone on Linux 2015-10-29
30390 Runtime misc bugzilla REOP --- mono build broken, libmonoutils fails to link 2015-05-30
30398 Runtime io-layer bugzilla NEW --- Building mono on android fails compiling io.c, struct statfs does not have f_flags 2015-05-25
30489 Runtime Debug vargaz NEW --- System.Diagnostics.Debug.Launch not implemented [enhancement] 2015-05-27
30553 Runtime GC bugzilla NEW --- Timing/race conditions in single core tests 2015-05-28
30666 Runtime Mono Too bugzilla NEW --- Mono XSP and XSP4 Errors 2015-06-02
30696 Runtime io-layer lexas NEW --- System.IO.IOException: persistent kevent() 2015-08-14
30708 Runtime Mono Too bugzilla NEW --- An exception was thrown by the type initializer for Mono.TextEditor.Utils.TextFileUtility .whats the 2015-07-13
30834 Runtime io-layer bugzilla NEW --- Console colors stop working if input is redirected 2015-06-05
30864 Runtime GC bugzilla NEW --- SEGV in SQLite binding during SGen GC collection 2015-06-11
30930 Runtime Debug alexander.kyte NEW --- Step over IF with 4 or more "is" operator checks exits method 2015-06-22
30969 Runtime JIT bugzilla NEW --- Too many root sets 2015-06-10
30979 Runtime misc lexas NEW --- Ungraceful mono crash when running F# exe file and missing FSharp.Core.dll 2016-03-24
31109 Runtime misc bugzilla NEW --- Problems with Assertions of the runtime in two cases 2015-09-15
31139 Runtime misc bugzilla NEW --- Mono-LLVM Unexpected Failures 2015-06-28
31187 Runtime Mono Too bugzilla NEW --- mono try to load a wrong unversioned gdiplus library 2015-06-17
31225 Runtime verifier kumpera NEW --- pedump reports invalid constructor while Microsoft's peverify reprots correct DLL 2016-04-16
31278 Runtime verifier bugzilla NEW --- Missing Error: Method has a duplicate 2015-06-22
31441 Runtime GC bugzilla NEW --- --with-gc=none configure option broken 2015-07-10
31550 Runtime misc bugzilla NEW --- RuntimeBinderContext missing from Microsoft.CSharp in 4.0 2015-07-01
31568 Runtime JIT bugzilla NEW --- cannot bootstrap mono-4.0.2 using make get-monolite-latest on ppc64le 2015-07-03
31761 Runtime JIT bugzilla NEW --- Starting Xamarin Studio returns error: "could not discover the mach TLS offset" 2016-07-31
31779 Runtime JIT bugzilla NEW --- mono-4.0.2 build failure on s390x 2015-07-09
31999 Runtime misc bugzilla NEW --- C99 and XPG5 don't match on Solaris 10+ 2015-07-16
32000 Runtime misc bugzilla NEW --- Confusion about --with-gc 2015-07-16
32004 Runtime misc bugzilla NEW --- Cannot disable -Werror-implicit-function-declaration 2015-07-16
32010 Runtime misc bugzilla NEW --- Missing declarations on Solaris 2015-07-16
32011 Runtime misc bugzilla NEW --- Enable PTHREAD_STACK_MIN on Solaris 2015-07-16
32012 Runtime misc bugzilla NEW --- Solaris lacks mono_threads_core_get_stack_bounds 2015-07-16
32013 Runtime misc bugzilla NEW --- Solaris lacks wapi_GetVolumeInformation 2015-07-16
32015 Runtime misc bugzilla NEW --- Wrong libmonoruntime-static.a reference in mono/dis with --disable-sgen 2016-02-09
32016 Runtime misc bugzilla NEW --- Reference to libmonoruntimesgen.la in mono/unit-tests breaks with --disable-sgen 2015-07-16
32018 Runtime misc bugzilla NEW --- test-conc-hashtable doesn't link 2015-07-16
32019 Runtime misc bugzilla NEW --- libc.so.6 reference on 64-bit Solaris/x86 2015-07-16
32021 Runtime misc bugzilla NEW --- Link failures without --disable-dtrace on Solaris 2015-07-19
32288 Runtime misc bugzilla NEW --- Mono Runtime 4.0.1, An DataTableMapping with DataSetTable 'table_name' is not contained by this DataTableMappingCollection. 2015-07-22
32332 Runtime generics bugzilla NEW --- Segmentation fault when calling NamedPipeServerStream.Disconnect() 2015-07-22
32464 Runtime JIT bugzilla NEW --- SIGABRT: Assertion at jit-info.c:699, condition `IS_JIT_INFO_TOMBSTONE (chunk->data [pos])' not met 2015-07-27
32465 Runtime GC bugzilla NEW --- SIGABRT: Error in `/usr/bin/mono': double free or corruption (fasttop): 0x00007f3e280da8a0 2015-07-27
32492 Runtime Mono Too bugzilla NEW --- monodis: User Strings table dump shows spurious empty strings 2016-04-16
32500 Runtime verifier bugzilla NEW --- InvalidProgramException 2015-08-03
32508 Runtime JIT vargaz NEW --- Inconsistent handling of AppDomain.CurrentDomain.UnhandledException 2016-01-25
32601 Runtime misc bugzilla NEW --- Mono 4.0 crashes when aborting threads 2016-03-29
32661 Runtime GC bugzilla NEW --- Mono Flag -gc=boehm doesn't work 2015-08-04
32739 Runtime misc bugzilla NEW --- Getting Segmentation Fault (SIGSEGV) 2015-08-13
32892 Runtime io-layer bugzilla NEW --- epoll related segfault leads to periodic crashes 2015-08-23
33003 Runtime JIT bugzilla NEW --- Performance problem when in inlining methods 2015-08-13
33066 Runtime Debug vargaz REOP --- Watch evaluations different in XS than VS 2015-10-09
33078 Runtime misc bugzilla NEW --- MSBiology benchmark hangs in Monitor.Wait 2015-08-13
33081 Runtime misc joao.matos ASSI --- Compile failure with -with-static_mono=no 2016-07-16
33101 Runtime interop bugzilla NEW --- [feature request] dllexport or DLL_THREAD_ATTACH 2015-08-14
33157 Runtime Debug vargaz NEW --- Bug trace with duplicati application in a linux NAS SERVER 2015-08-17
33286 Runtime io-layer bugzilla NEW --- Sockets not properly returning from unmanaged threadpool 2015-08-27
33411 Runtime misc bugzilla NEW --- Crash: could not resolve field token 0x040000c2 2015-10-26
33430 Runtime Debug vargaz REOP --- Unable to set next statement in PCL project 2016-05-17
33488 Runtime JIT bugzilla NEW --- Assertion: should not be reached at loader.c:297 2015-09-01
33508 Runtime GC bugzilla NEW --- MONO_GC_PARAMS='major=marksweep-conc' causes ObjectDisposedException 2015-08-31
33728 Runtime misc bugzilla NEW --- Assembly.Load loads the same assembly if multiple assemblies have the same name. 2015-10-17
33762 Runtime misc bugzilla NEW --- Shutdown deadlock 2015-09-08
33871 Runtime misc bugzilla NEW --- Async call does not return within NUnit test 2015-09-12
34064 Runtime JIT ludovic NEW --- Possible Thread.Join issue with Mono runtime 2015-09-27
34078 Runtime JIT bugzilla NEW --- LLVM / native stack trace failure on trivial F# exe comparing structures (general & fundamental problem in codegen) 2015-09-19
34103 Runtime JIT bugzilla NEW --- Unknown Filename/Line number in exception messages 2015-09-21
34120 Runtime misc alexander.kyte NEW --- memory leak in AppDomain.Unload 2016-03-21
34166 Runtime Mono Too alexrp ASSI --- [Profiler] Xamarin Studio crashes when being profiled. 15:43:54
34275 Runtime JIT bugzilla NEW --- Crash probably related to app domains 2015-12-21
34352 Runtime misc bugzilla NEW --- Link broken 2015-09-28
34398 Runtime misc bugzilla NEW --- runtime hook for unhandled exceptions not always called 2015-09-29
34496 Runtime misc bugzilla NEW --- icon not displayed on taskbar 2015-10-01
34550 Runtime GC bugzilla NEW --- Crash in array clone x509 cert 2015-10-05
34813 Runtime JIT bugzilla NEW --- Casting Double to Int64 yields invalid value on PowerPC 2015-10-14
35082 Runtime GC bugzilla NEW --- Crash in El Capitan when sitting idle 2015-10-21
35104 Runtime misc ludovic NEW --- Big slowdown on Eventstore and smaller ones on Roslyn and MSBiology 2015-10-20
35136 Runtime misc bugzilla NEW --- Mempool allocation strategy can lead to "leaked" allocated-but-unusable memory 2015-10-21
35166 Runtime io-layer bugzilla NEW --- File Access fails when using Linux Tool cpulimit 2015-10-22
35376 Runtime misc bugzilla NEW --- OdbcDataReader:GetValue stuck in loop - System.Data.Odbc.libodbc:SQLGetDataGetData, System.Data.Odbc.OdbcColumn:get_SqlCType 2015-10-29
35393 Runtime Mono Too bugzilla NEW --- NUnit System.MissingMethodException : Method 'IConfigurationSectionHandler.Create' 2015-10-30
35563 Runtime misc bugzilla NEW --- ASN1 class behaves differently under mono vs dotnet 2015-11-14
35651 Runtime misc bugzilla NEW --- SIGSEGV when building FAKE 2015-11-07
35716 Runtime misc lexas ASSI --- Runtime freezes instantiating a Bitmap object 2015-11-17
36081 Runtime Mono Too vargaz ASSI --- Monodis crash processing this assembly 2016-01-07
36296 Runtime Mono Too bugzilla NEW --- Function returning funcion produces null references only via fsharpi 2015-11-26
36300 Runtime JIT vargaz NEW --- JIT intrinsics do not perform explicit null checks 2015-12-17
36851 Runtime GC vargaz REOP --- Xamarin Studio (w/ Roslyn) crash 2016-06-13
36883 Runtime packagin lexas ASSI --- MKBundled Mono Exe checking for Dependency in Library Folder 2016-05-23
36941 Runtime io-layer ludovic NEW --- setting MulticastTimeToLive on Socket throws exception 2015-12-22
37161 Runtime GC bugzilla NEW --- [sgen] Sgen cannot free memory on windows 2015-12-19
37226 Runtime Mono Too alexrp NEW --- [Profiler] Sampling still doesn't work on Android 2016-04-12
37229 Runtime io-layer bugzilla NEW --- High concurrent load OWIN 2015-12-22
37388 Runtime Mono Too bugzilla NEW --- Platform detection for Raspbian 2016-04-21
37421 Runtime misc bugzilla NEW --- [suspend] Remove async suspend hacks 2016-01-25
37423 Runtime misc andi.mcclure ASSI --- Outstanding mempool check violations in Linq and Http.SelfHost 2016-01-20
37486 Runtime GC bugzilla NEW --- Memory Leak With NLog Async Logging 2016-01-07
37772 Runtime Reflecti bugzilla NEW --- Instance.GetType ().GetInterface (SomeInterfaceFullName, true) returns null only on MacOs 2016-04-28
37822 Runtime GC andi.mcclure NEW --- Repeated array allocation fails with certain code paths 2016-02-25
37900 Runtime GC andi.mcclure ASSI --- Crash starting Xamarin Studio 2016-07-12
37913 Runtime JIT bugzilla NEW --- JIT code generator fails on MSVC managed C++ ctor IL code on x86_64 target 2016-02-09
38009 Runtime Debug alexander.kyte NEW --- non-linear code in seq point calculation 2016-03-22
38013 Runtime misc bugzilla NEW --- 90% Speed Slowdown in 4.2.1 vs 4.0.5.1 2016-02-16
38538 Runtime io-layer bugzilla NEW --- Sharing violation on FAT file systems on OSX with empty files 2016-02-08
38544 Runtime GC bugzilla NEW --- Process.Start crashes on SMP ARM systems (dual-core iMX6) 2016-02-26
38631 Runtime interop bugzilla NEW --- I try to use Compresed Websockets in Mono (using https://github.com/sta/websocket-sharp) 2016-08-14
38794 Runtime misc aleksey ASSI --- Segmentation fault Console.ReadLine while exiting the application 2016-02-22
38997 Runtime GC bugzilla NEW --- App crashes on launch when run with the timing instrument 2016-02-23
39011 Runtime misc martin.baulig NEW --- Mono TLS is broken 2016-03-12
39022 Runtime JIT bugzilla NEW --- Error in native code 2016-02-22
39089 Runtime packagin lexas NEW --- Microsoft.Owin Unhandled Loader Error 2016-02-24
39176 Runtime JIT bugzilla REOP --- C# .NET 4.5 | System.InvalidProgramException: Invalid IL code 2016-03-04
39343 Runtime misc bugzilla NEW --- Embedded API: Method signature look up fails for generic types with more than one parameter 2016-03-04
39371 Runtime Debug vargaz NEW --- Filtering exception that is thrown and caught in non-user code is not working correctly 2016-06-29
39469 Runtime misc bugzilla NEW --- mprof-report reports unresolved classes 2016-04-16
39471 Runtime misc bugzilla NEW --- Complex console app crashing silently on Mono 4.2.0, running for a while on 4.5, then SIGSEGVing 2016-03-08
39727 Runtime Debug vargaz NEW --- ppdb debugging crashes with * Assertion at debugger-agent.c:8520, condition `locals->locals [i].index < header->num_locals' not met 2016-08-07
39786 Runtime misc bugzilla NEW --- Hard Crash: poll_event_wait: mono_poll () failed, error (10) No child processes 2016-03-19
39861 Runtime misc bugzilla NEW --- Segmentation fault when using multiple threads and doing some work. 2016-04-12
39879 Runtime io-layer ludovic ASSI --- Assertion at threadpool-ms-io.c:370, condition ‘fd >= 0’ not met 2016-04-06
39894 Runtime Debug vargaz NEW --- Mono.Debugger.Soft tests failures with ppdb 2016-03-24
39905 Runtime Debug vargaz NEW --- Assertion at mono-threads.c:326, condition `result' not met 2016-03-25
39940 Runtime misc bugzilla NEW --- Unmanaged memory leaks detected by valgrind 2016-04-25
40020 Runtime misc alexander.koeplinger ASSI --- Windows build failing 2016-04-04
40037 Runtime JIT bugzilla NEW --- Cannot build mono on PPC32 (BE) when PPC_64K_PAGES is set 2016-04-11
40153 Runtime JIT bugzilla NEW --- SGEN_DEBUG_INTERNAL_ALLOC 2016-04-06
40234 Runtime misc bugzilla NEW --- Strings get corrupted sometimes 2016-04-08
40248 Runtime interop bugzilla NEW --- Mono on OS X does not search for a library without a "lib" prefix at the path of the executable 2016-04-08
40399 Runtime GC bugzilla NEW --- error: * Assertion at gc.c:867, condition `finalizer_thread_exited' not met 2016-04-14
40425 Runtime Debug vargaz NEW --- Fatal error with writing in Trace 2016-04-15
40426 Runtime JIT bugzilla NEW --- I event don't know why it happenes 2016-04-15
40484 Runtime JIT bugzilla NEW --- Corrupted floating point registers on x86 2016-04-18
40517 Runtime GC bugzilla NEW --- SGEN assertion when invoking nuget 2016-04-19
40604 Runtime misc bugzilla NEW --- video surveilance emgucv application hangs 2016-04-21
40610 Runtime GC bugzilla NEW --- SIGSEGV when creating 52.000.000 objects in Parallel.For 2016-04-21
40626 Runtime misc bugzilla NEW --- FreeBSD mono-4.2.3.4 perfcounters sysconf error 2016-04-21
40627 Runtime misc bugzilla NEW --- crosscompilation for arm64 fails with linking errors 2016-05-15
40663 Runtime Debug vargaz NEW --- 100% reliable crash on XamMac 2016-04-24
40664 Runtime JIT kumpera NEW --- JIT can't handle Cxx pattern for loading pointers 2016-04-24
40691 Runtime Reflecti bugzilla NEW --- Unmanaged memory leak when using DynamicMethod 2016-05-15
40699 Runtime io-layer bugzilla NEW --- Console.ReadXXX does not echo input when CancelKeyPress event used 2016-05-06
40778 Runtime JIT bugzilla NEW --- AOT compiler crashes with C# with all Optimizations activated (-O=all) 2016-05-09
40785 Runtime misc bugzilla NEW --- unit-console.exe fails 2016-05-02
40843 Runtime GC bugzilla NEW --- Broken and incomplete GC logging 2016-05-03
40851 Runtime JIT bugzilla NEW --- Strong naming -> FieldAccessException 2016-05-17
40953 Runtime Reflecti bugzilla NEW --- Bad performance using TypeBuilder 2016-05-12
41097 Runtime GC bugzilla NEW --- Mono crashes when starting XSP 2016-05-16
41130 Runtime Reflecti bugzilla NEW --- Segmentation Fault on calling Type.GetField() for generic dynamic types 2016-05-17
41140 Runtime packagin lexas NEW --- bundled ironpython quite old (nearly 5 years), suggest upgrading to 2.7.5/2.7.6 2016-05-27
41202 Runtime GC vlad.brezae ASSI --- "System.ArgumentException: GCHandle value belongs to a different domain" is thrown when I hold strong reference with GCHandle and delete it in finalizer 2016-07-21
41279 Runtime JIT bugzilla NEW --- Wrong syntax used for nested types in MethodAccessException (and similar) 2016-05-24
41294 Runtime misc ludovic ASSI --- Some Mono threadpool performance counters return 0 09:08:17
41323 Runtime misc bugzilla NEW --- Network Interface performance counters not reporting any instances in Mac OSX 2016-05-26
41544 Runtime packagin lexas NEW --- win32 mono is missing the glib-networking module for TLS/SSL support. 2016-06-07
41578 Runtime misc kumpera ASSI --- Bad error reporting in loader 2016-06-08
41764 Runtime JIT alexander.kyte NEW --- System.Transactions.TransactionScopeTest.ExplicitTransaction10b hangs 2016-06-13
41802 Runtime misc bugzilla NEW --- Unexpected "failed to get 100ns ticks" in program output (mono-4.4.0.142,Windows) 2016-08-03
41818 Runtime GC bugzilla NEW --- Find Reference in XS seems to cause GC problems 2016-06-14
41891 Runtime Debug vargaz NEW --- Ping() does not work 2016-06-16
41910 Runtime GC bugzilla NEW --- IsolatedStorage breaks on el capitan on OSX with concurrent GC 2016-08-16
41914 Runtime io-layer ludovic NEW --- Race condition in named mutex 2016-06-24
41941 Runtime JIT alexander.kyte NEW --- Thread Abort Exceptions not caught in mono/tests test on bitcode 2016-06-17
41945 Runtime JIT alexander.kyte NEW --- Bitcode exception-related tests failing 2016-06-21
41950 Runtime JIT alexander.kyte NEW --- Bitcode stackoverflow with even-odd.exe test 2016-06-20
41953 Runtime packagin jo.shields ASSI --- Wrong directory name used for libraries on Red Hat & SUSE (lib64 -> lib) Thu 10:38
41970 Runtime JIT bugzilla NEW --- OutOfMemoryException while working with seq 2016-06-21
41995 Runtime GC bugzilla NEW --- [Concurrent SGen] Assertion: should not be reached at sgen-marksweep.c:1103 2016-06-20
42134 Runtime interop bugzilla NEW --- DllNotFoundException for x64 Mono on Windows, x86 Mono ok on Windows, both ok on Linux Red Hat and .NET 2016-06-23
42138 Runtime Reflecti bugzilla NEW --- Assembly.LoadWithPartialName() insists on having the disk file, but does not use it. 2016-06-24
42271 Runtime misc bugzilla NEW --- COOP: gc unsafe mode when printing native backtrace causes crash if GC is triggered 2016-06-30
42314 Runtime io-layer bugzilla NEW --- Native crash in socket API 2016-07-01
42315 Runtime io-layer bugzilla NEW --- Socket poll returns true when socket hasn't contains any data 2016-07-01
42334 Runtime generics bugzilla NEW --- App crashes after Main execution finished 2016-07-08
42365 Runtime packagin lexas ASSI --- Mono 4.4.1 OSX package doesn't clean up old symlinks from /usr/local/bin 2016-07-08
42414 Runtime packagin lexas ASSI --- Run path_helper in OSX postinstall script to make Mono commands available in same shell session 2016-07-08
42417 Runtime Reflecti kumpera ASSI --- Mono's System.Reflection crash when fsharp compiler is called by fsharpi 2016-07-21
42665 Runtime misc ludovic ASSI --- Random hangs / deadlock when running mono 2016-07-22
42888 Runtime misc bugzilla NEW --- Crash when Serializing - Newtonsoft C# 2016-07-28
42945 Runtime io-layer bugzilla NEW --- Asynchronous IO seems slow when compared to CoreCLR 2016-07-31
43004 Runtime JIT bugzilla NEW --- mcs.exe freezes 2016-08-07
43025 Runtime verifier kumpera NEW --- Error: Metadata verifier doesn't handle sections with intialized data only 2016-08-03
43026 Runtime io-layer ludovic NEW --- Process.ExitCode throws an exception if accessed inside the `Exited` event 2016-08-03
43095 Runtime JIT marcos.henrich NEW --- symbolication offsets are wrong when nops exist 15:24:19
43172 Runtime io-layer marcos.henrich ASSI --- Failure when alerting threads waiting on a socket that closes 06:20:38
43320 Runtime misc kumpera ASSI --- Thread aborts in the middle of .cctor and hell break loose 2016-08-14
43502 Runtime io-layer alexrp ASSI --- Too many open files 06:40:24
43696 Runtime JIT bugzilla NEW --- Delegate caching can invoke unrelated implementation leading to strange results Wed 08:54
43786 Runtime misc bugzilla NEW --- peverify is broken again 16:22:21
422 bugs found.

as

File a new bug in the "Runtime" product