Sun Oct 22 2017 06:28:52 UTC
Why is is always my job to fix every family members computer problems...
Hide Search Description
84 bugs found.
ID Product Comp Assignee Status Resolution Summary Changed
12635 Runtime JIT bugzilla NEW --- Tail calls inside continuations cause StackOverflow 2016-02-17
50191 Runtime JIT vargaz NEW --- SGEN YMM scanning: Linux and Darwin on Intel 2016-12-15
18619 Runtime JIT bugzilla NEW --- COM Interop Regression crash introduced between 3.0.12 and 3.1.1. 2014-05-21
19136 Runtime JIT bugzilla NEW --- ThreadAbortException Not finishing Finally block ARM 2014-06-21
20721 Runtime JIT bugzilla NEW --- A cast of double to int can possibly result in int.MinValue 2014-06-19
24093 Runtime JIT bugzilla NEW --- Mono 3.10 build fails on CentOS 5.11 amd64 2015-04-14
25097 Runtime JIT bugzilla NEW --- mono stack-buffer-overflow on latest build 2015-04-14
25681 Runtime JIT bugzilla NEW --- F# compiler generates code with stack overflow for trivial recursion (GCD) 2017-08-28
26394 Runtime JIT bugzilla NEW --- Error in call unsafe code 2015-01-26
27728 Runtime JIT bugzilla NEW --- Exception in Exception filters (C# 6) 2015-03-09
27881 Runtime JIT bugzilla NEW --- Bad virtual lookup for new abstract member 2015-03-11
29766 Runtime JIT bugzilla NEW --- Mono Runtime crashes when used with valgrind with/without Embedded Runtime 2017-03-17
30090 Runtime JIT bugzilla NEW --- AOT compiler on OSX crashes with F# compiler and -O=all 2015-05-14
30969 Runtime JIT bugzilla NEW --- Too many root sets 2015-06-10
31568 Runtime JIT bugzilla NEW --- cannot bootstrap mono-4.0.2 using make get-monolite-latest on ppc64le 2015-07-03
31761 Runtime JIT bugzilla NEW --- Starting Xamarin Studio returns error: "could not discover the mach TLS offset" 2016-07-31
31779 Runtime JIT bugzilla NEW --- mono-4.0.2 build failure on s390x 2015-07-09
32464 Runtime JIT bugzilla NEW --- SIGABRT: Assertion at jit-info.c:699, condition `IS_JIT_INFO_TOMBSTONE (chunk->data [pos])' not met 2015-07-27
33003 Runtime JIT bugzilla NEW --- Performance problem when in inlining methods 2015-08-13
33488 Runtime JIT bugzilla NEW --- Assertion: should not be reached at loader.c:297 2015-09-01
34078 Runtime JIT bugzilla NEW --- LLVM / native stack trace failure on trivial F# exe comparing structures (general & fundamental problem in codegen) 2015-09-19
34103 Runtime JIT bugzilla NEW --- Unknown Filename/Line number in exception messages 2015-09-21
34275 Runtime JIT bugzilla NEW --- Crash probably related to app domains 2015-12-21
34813 Runtime JIT bugzilla NEW --- Casting Double to Int64 yields invalid value on PowerPC 2015-10-14
37913 Runtime JIT bugzilla NEW --- JIT code generator fails on MSVC managed C++ ctor IL code on x86_64 target 2016-02-09
39022 Runtime JIT bugzilla NEW --- Error in native code 2016-02-22
40037 Runtime JIT bugzilla NEW --- Cannot build mono on PPC32 (BE) when PPC_64K_PAGES is set 2016-04-11
40153 Runtime JIT bugzilla NEW --- SGEN_DEBUG_INTERNAL_ALLOC 2016-04-06
40426 Runtime JIT bugzilla NEW --- I event don't know why it happenes 2016-04-15
40484 Runtime JIT bugzilla NEW --- Corrupted floating point registers on x86 2016-04-18
40778 Runtime JIT bugzilla NEW --- AOT compiler crashes with C# with all Optimizations activated (-O=all) 2016-05-09
40851 Runtime JIT bugzilla NEW --- Strong naming -> FieldAccessException 2016-05-17
44204 Runtime JIT bugzilla NEW --- Initializing a float array with a negative size throws incorrect exception 2017-03-07
44819 Runtime JIT bugzilla NEW --- crash application 2016-09-28
45370 Runtime JIT bugzilla NEW --- Exception occurring during exception filter evaluation is not handled 2016-10-13
47346 Runtime JIT bugzilla NEW --- * Assertion at ..\mono\mini\mini-exceptions.c:625, condition `klass' not met 2016-11-18
47424 Runtime JIT bugzilla NEW --- ARM64 issue with lock on Dictionary causes KeyNotFoundException 2016-12-01
51150 Runtime JIT bugzilla NEW --- Using a lot of memory and not using CPU much... 2017-01-04
52687 Runtime JIT bugzilla NEW --- error of wcf working 2017-07-13
52735 Runtime JIT bugzilla NEW --- Mono too aggressively optimized code. Skip convert 2017-03-02
52742 Runtime JIT bugzilla NEW --- AOTing reference assembly should be at least warning 2017-02-24
52972 Runtime JIT bugzilla NEW --- System.TypeLoadException: Could not resolve type with token 010000db 2017-03-02
53300 Runtime JIT bugzilla NEW --- shared violation on path /dev/usb/lp0 2017-03-14
53375 Runtime JIT bugzilla NEW --- crash fastcgi 2017-03-15
53439 Runtime JIT bugzilla NEW --- System.Numerics tests on windows fail with System.BadImageFormatException 2017-06-12
55546 Runtime JIT bugzilla NEW --- CSharp tests fails on s390x 2017-04-27
55711 Runtime JIT bugzilla NEW --- Random csc(from nuget) crash on mono/master 2017-05-16
55931 Runtime JIT bugzilla NEW --- 32-bit Intel FullAOT test always crashes 2017-07-19
55932 Runtime JIT bugzilla NEW --- FullAOT lanes fail "verify" step on every build 2017-07-19
56665 Runtime JIT bugzilla NEW --- roslyn SIGSEGV in Microsoft.Cci.PooledBlobBuilder..ctor on armv7/arm64 2017-09-21
59976 Runtime JIT bugzilla NEW --- * Assertion at mini-exceptions.c:2114, condition `ji == mini_jit_info_table_find (domain, (char *)MONO_CONTEXT_GET_IP (&jit_tls->handler_block_context), NULL)' not met 2017-10-05
60044 Runtime JIT bugzilla NEW --- Implementations of Math.Exp() and Math.Log() differ between OSes 2017-10-10
60243 Runtime JIT bugzilla NEW --- Calling a vararg method on a generic instance throws BadImageFormatException Tue 22:04
60255 Runtime JIT bugzilla NEW --- Wrong exception in emulated opcodes Wed 14:48
32508 Runtime JIT vargaz NEW --- Inconsistent handling of AppDomain.CurrentDomain.UnhandledException 2016-01-25
36300 Runtime JIT vargaz NEW --- JIT intrinsics do not perform explicit null checks 2015-12-17
45177 Runtime JIT vargaz NEW --- LLVMVerifyModule assert failure in Intel64 AOT Bitcode build 2016-10-12
53192 Runtime JIT vargaz NEW --- roslyn SIGSEGV on big endian PPC machine 2017-04-10
41764 Runtime JIT alexander.kyte CONF --- System.Transactions.TransactionScopeTest.ExplicitTransaction10b hangs 2016-09-14
41945 Runtime JIT alexander.kyte CONF --- Bitcode exception-related tests failing 2016-10-13
41950 Runtime JIT alexander.kyte CONF --- Bitcode stackoverflow with even-odd.exe test 2016-09-14
6346 Runtime JIT bugzilla CONF --- Mono does not support vararg pinvoke methods 2017-07-12
41970 Runtime JIT vargaz CONF --- OutOfMemoryException while working with seq 2016-09-14
32122 Runtime JIT bugzilla CONF --- SIGSEGV when using Multiple threads and BlockCollection<T> with ConcurrentQueue<T> as data store 2016-08-17
33071 Runtime JIT bugzilla CONF --- Incorrect interface method used in generic variance calls 2015-08-14
52287 Runtime JIT bugzilla CONF --- fix the coreclr tests failing in acceptance-tests 2017-10-06
56546 Runtime JIT bugzilla CONF --- [arm64] NRE in Microsoft.CodeAnalysis.CSharp.CSharpSyntaxNode:ComputeSyntaxTree (roslyn) Mon 11:31
57336 Runtime JIT bugzilla CONF --- System.Numerics corefx test failures 2017-07-03
58901 Runtime JIT bugzilla CONF --- Breaking ABI change on 32 bits with xcode 8.3 or newer 2017-09-07
59400 Runtime JIT bugzilla CONF --- Wrong interface method is called (two interfaces, covariance) 2017-10-13
54388 Runtime JIT kg CONF --- InternalsVisibleTo is case sensitive 2017-09-06
35492 Runtime JIT vargaz CONF --- Native crash arm64 ABI 2016-07-13
16808 Runtime JIT vargaz ASSI --- ThreadAbortException. Finally block does not execute 2016-09-18
57742 Runtime JIT vargaz ASSI --- [LLVM] Build broken -> Option already exists! 2017-09-21
41941 Runtime JIT alexander.kyte NEED --- Thread Abort Exceptions not caught in mono/tests test on bitcode 2017-09-06
11100 Runtime JIT bugzilla NEED --- xsp segfaults on mono 3.0.8 (March 13) 2017-10-14
12307 Runtime JIT bugzilla NEED --- Unhandled exception at 0x65B513F7 (mono-2.0.dll) in mono.exe 2017-10-14
17572 Runtime JIT bugzilla NEED --- Unfounded 'ExecutionEngineException: Attempting to JIT compile method while running with --aot-only" 2017-10-14
18098 Runtime JIT bugzilla NEED --- Mono runtime SIGSEGV while xsp2 is handling ThreadAbortException 2017-10-14
39176 Runtime JIT bugzilla NEED --- C# .NET 4.5 | System.InvalidProgramException: Invalid IL code 2017-09-06
59330 Runtime JIT bugzilla NEED --- "(UInt64)2 ** (UInt16)2" expression compilation cause "System.InvalidProgramException : float conv.ovf.un opcodes not supported." 2017-09-21
59402 Runtime JIT bugzilla NEED --- Invalid emitted IL using Reflection causes Mono to crash. 2017-09-21
23392 Runtime JIT bugzilla REOP --- * Assertion at mini-codegen.c:2307, condition `sp < 8' not met 2014-09-29
25224 Runtime JIT bugzilla REOP --- stack overflow after printfn something 2017-01-06
84 bugs found.

as

File a new bug in the "JIT" component of the "Runtime" product