Bug 8475 - NTLMv2 commit makes me not able to compile mono
Summary: NTLMv2 commit makes me not able to compile mono
Alias: None
Product: Class Libraries
Classification: Mono
Component: System.Security ()
Version: unspecified
Hardware: PC Linux
: --- normal
Target Milestone: Untriaged
Assignee: Bugzilla
Depends on:
Reported: 2012-11-17 09:13 UTC by Andres G. Aragoneses
Modified: 2012-11-17 10:07 UTC (History)
1 user (show)

Is this bug a regression?: ---
Last known good build:

Notice (2018-05-24): bugzilla.xamarin.com is now in read-only mode.

Please join us on Visual Studio Developer Community and in the Xamarin and Mono organizations on GitHub to continue tracking issues. Bugzilla will remain available for reference in read-only mode. We will continue to work on open Bugzilla bugs, copy them to the new locations as needed for follow-up, and add the new items under Related Links.

Our sincere thanks to everyone who has contributed on this bug tracker over the years. Thanks also for your understanding as we make these adjustments and improvements for the future.

Please create a new report on GitHub or Developer Community with your current version information, steps to reproduce, and relevant error messages or log files if you are hitting an issue that looks similar to this resolved bug and you do not yet see a matching new report.

Related Links:

Description Andres G. Aragoneses 2012-11-17 09:13:14 UTC
This commits makes me unable to compile mono in Debian:

(If I revert the commit, it works.)

The error is:

MCS     [net_2_0] System.dll
Mono.Http/NtlmClient.cs(92,26): error CS1502: The best overloaded method match for `Mono.Security.Protocol.Ntlm.Type3Message.Type3Message(byte[])' has some invalid arguments
/home/dev/mono/mcs/class/lib/net_2_0/Mono.Security.dll (Location of the symbol related to previous error)
Mono.Http/NtlmClient.cs(92,44): error CS1503: Argument `#1' cannot convert `Mono.Security.Protocol.Ntlm.Type2Message' expression to type `byte[]'
Compilation failed: 2 error(s), 0 warnings
make[8]: *** [../../class/lib/net_2_0/tmp/System.dll] Error 1
make[7]: *** [do-all] Error 2
make[6]: *** [all-recursive] Error 1
make[5]: *** [all-recursive] Error 1
make[4]: *** [profile-do--net_2_0--all] Error 2
make[3]: *** [profiles-do--all] Error 2
make[2]: *** [all-local] Error 2
make[2]: Leaving directory `/home/dev/mono/runtime'
make[1]: *** [all-recursive] Error 1
make[1]: Leaving directory `/home/dev/mono'
make: *** [all] Error 2
Comment 1 Andres G. Aragoneses 2012-11-17 10:07:29 UTC
Sorry for the noise. False alarm. Problem was apparently between the keyboard and the chair.