Bug 18829 - install: cannot stat 'targets/Microsoft.Portable.Common.targets': No such file or directory
Summary: install: cannot stat 'targets/Microsoft.Portable.Common.targets': No such fil...
Status: RESOLVED DUPLICATE of bug 18690
Alias: None
Product: Tools
Classification: Mono
Component: xbuild ()
Version: unspecified
Hardware: PC Linux
: --- normal
Target Milestone: ---
Assignee: Bugzilla
Depends on:
Reported: 2014-04-06 03:30 UTC by Matthias Mailänder
Modified: 2014-04-06 14:16 UTC (History)
1 user (show)

Is this bug a regression?: ---
Last known good build:

Notice (2018-05-24): bugzilla.xamarin.com is now in read-only mode.

Please join us on Visual Studio Developer Community and in the Xamarin and Mono organizations on GitHub to continue tracking issues. Bugzilla will remain available for reference in read-only mode. We will continue to work on open Bugzilla bugs, copy them to the new locations as needed for follow-up, and add the new items under Related Links.

Our sincere thanks to everyone who has contributed on this bug tracker over the years. Thanks also for your understanding as we make these adjustments and improvements for the future.

Please create a new report on GitHub or Developer Community with your current version information, steps to reproduce, and relevant error messages or log files if you are hitting an issue that looks similar to this resolved bug and you do not yet see a matching new report.

Related Links:

Description Matthias Mailänder 2014-04-06 03:30:56 UTC
Tried to update the openSUSE RPM package, but make install fails:

/usr/bin/install -c -c -m 644 targets/Microsoft.Portable.Common.targets /home/abuild/rpmbuild/BUILDROOT/mono-core-3.4.0-142.1.i386/usr/lib/mono/xbuild/Microsoft/Portable/v4.0/Microsoft.Portable.Common.targets
/usr/bin/install: cannot stat 'targets/Microsoft.Portable.Common.targets': No such file or directory
make[7]: *** [install-pcl-targets] Error 1
make[7]: Leaving directory `/home/abuild/rpmbuild/BUILD/mono-3.4.0/mcs/tools/xbuild'
make[6]: *** [do-install] Error 2
make[6]: Leaving directory `/home/abuild/rpmbuild/BUILD/mono-3.4.0/mcs/tools/xbuild'
make[5]: *** [install-recursive] Error 1
make[5]: Leaving directory `/home/abuild/rpmbuild/BUILD/mono-3.4.0/mcs/tools'
make[4]: *** [install-recursive] Error 1
make[4]: Leaving directory `/home/abuild/rpmbuild/BUILD/mono-3.4.0/mcs'
make[3]: *** [profile-do--net_2_0--install] Error 2
make[3]: Leaving directory `/home/abuild/rpmbuild/BUILD/mono-3.4.0/mcs'
make[2]: *** [profiles-do--install] Error 2
make[2]: Leaving directory `/home/abuild/rpmbuild/BUILD/mono-3.4.0/mcs'
make[1]: *** [install-exec] Error 2
make[1]: Leaving directory `/home/abuild/rpmbuild/BUILD/mono-3.4.0/runtime'
make: *** [install-recursive] Error 1
error: Bad exit status from /var/tmp/rpm-tmp.oqdipK (%install)
Comment 1 Mikayla Hutchinson [MSFT] 2014-04-06 14:16:17 UTC

*** This bug has been marked as a duplicate of bug 18690 ***