Bug 10070 - Error compiling from git on Ubuntu 12.10
Summary: Error compiling from git on Ubuntu 12.10
Alias: None
Product: Runtime
Classification: Mono
Component: Debugger ()
Version: unspecified
Hardware: PC Linux
: --- normal
Target Milestone: ---
Assignee: Bugzilla
Depends on:
Reported: 2013-02-06 03:07 UTC by bar.hofesh@safe-t.com
Modified: 2013-02-07 05:41 UTC (History)
3 users (show)

Is this bug a regression?: ---
Last known good build:

Notice (2018-05-24): bugzilla.xamarin.com is now in read-only mode.

Please join us on Visual Studio Developer Community and in the Xamarin and Mono organizations on GitHub to continue tracking issues. Bugzilla will remain available for reference in read-only mode. We will continue to work on open Bugzilla bugs, copy them to the new locations as needed for follow-up, and add the new items under Related Links.

Our sincere thanks to everyone who has contributed on this bug tracker over the years. Thanks also for your understanding as we make these adjustments and improvements for the future.

Please create a new report on GitHub or Developer Community with your current version information, steps to reproduce, and relevant error messages or log files if you are hitting an issue that looks similar to this resolved bug and you do not yet see a matching new report.

Related Links:

Description bar.hofesh@safe-t.com 2013-02-06 03:07:21 UTC
This is the error:

make[4]: Entering directory `/tmp/mono/mono/mono/mini'
  CC     libmini_la-mini.lo
mini.c:7341:1: error: conflicting types for ‘mono_arch_get_gsharedvt_call_info’
In file included from mini.c:60:0:
mini.h:2155:11: note: previous declaration of ‘mono_arch_get_gsharedvt_call_info’ was here
make[4]: *** [libmini_la-mini.lo] Error 1
make[4]: Leaving directory `/tmp/mono/mono/mono/mini'
make[3]: *** [all] Error 2
make[3]: Leaving directory `/tmp/mono/mono/mono/mini'
make[2]: *** [all-recursive] Error 1
make[2]: Leaving directory `/tmp/mono/mono/mono'
make[1]: *** [all-recursive] Error 1
make[1]: Leaving directory `/tmp/mono/mono'
make: *** [all] Error 2
Comment 1 Zoltan Varga 2013-02-07 05:41:10 UTC
Already fixed.